{"text_format":"1","workbook":"xlsx","n_sheets":6,"sheets":["Intro","Tool","Best practice overview ","Glossary","Database Measures","Dropdowns"],"not_rendered":{"charts":0,"images":5,"macros":1,"external_links":0,"defined_names":3,"comments":0,"pivot_tables":0},"unopened":[],"bounds":{"document_bytes":16777216,"sheet_cells":100000,"rows_first":2000,"rows_last":500,"rows_between":2000,"halvings":0,"cell_chars":16384,"cell_head_chars":4096},"cells_cut":0,"cells_raw":0,"read":"whole","date_system":"1900"}

{"sheet":"Intro","index":0,"n_rows":0,"n_cols":0,"rows_kept":0,"cut":false,"hidden":false,"merged":[]}

{"sheet":"Tool","index":1,"n_rows":70,"n_cols":6,"rows_kept":70,"cut":false,"hidden":false,"merged":[[37,4,44,4]]}
[null,1]
[]
[]
[]
[]
[]
[null,"For definitions of some important terms see glossary!"]
[]
[]
[null,"Please fill in the blue cells"]
[]
[null,"Select a dimension",null,"Select a goal"]
[null,null,null," ","If you are interested in gaining a gereral overview of possible measures, \nwe recommend using the \"Best practice overview\" sheet!"]
[]
[]
{"$rows_left_out":56}
{"sheet":"Best practice overview ","index":2,"n_rows":47,"n_cols":11,"rows_kept":47,"cut":false,"hidden":false,"merged":[[3,0,3,1]]}
[]
[]
[null,null,"Filter by goal"]
["Please scroll down to see all measures belonging to the selected goal!"]
[]
["Measure","Best practice","Goal","Spatial dimension","Description","Impacts","Link/contact"]
["App for promoting sustainable modes in first and last mile","Green Miles","Promotion of sustainability in first and last mile","Urban, suburban, rural","The green miles mobile application is a free interactive tracking app and provides an incentive system, which consists of a credit system and a gamification approach. Users collect green miles by using sustainable modes, which can be used for discounts on train tickets or at sports shops.","The app has impacts on the modal split and on CO2 emissions.","https://www.wu.ac.at/entrep/kooperationen/bisherige-praxisprojekte/practiceproj-detail/detail/green-miles/"]
["awareness-raising among decision-makers","City Cycling+: Cycling for a Better Climate","Increasing the modal split of cycling","Urban, suburban, rural","CITY CYCLING+ aims at bringing the public in the district of Emmendingen, Germany to use the bicycle more frequently for daily mobility routines. The campaign focuses on making politicians and local decision-makers aware of the lack of safe cycling infrastructure by getting them on their own bikes. The district also uses the RADar! reporting platform, which is part of the campaign. Cyclists can report problems in the cycling infrastructure directly to the administration.","In the scope of the project in 2019, 280,7km were cycled and 40 tons of CO2 were avoided. 59 of 199 local parliamentarians participated. Including all participants, 7,9% claimed that they use their bike significantly more often. 32,8% stated that they use their bike slightly more often. In 2020, 4462 cyclists avoided 163 tons of CO2 by covering 1.109.769 km by bike. In 2020, the county also participated for the first time together with the twin municipality in France. The program furthermore contributes to a healthier lifestyle and reduced air pollution.","https://www.stadtradeln.de/alsace-centrale"]
["Bicycle communication campaign","Radlhauptstadt München","Increasing the modal split of cycling","Urban, suburban, rural","This program promotes cycling in Munich with the help of a communication campaign including e.g. bicycle tours, bicycle safety checks, photoshoots, bicycle exhibitions and school activities.","The amount of trips by bike increased from 8.1% to 14% in 2 years, however with the help of an improvement in the cycling infrastructure. Many switches were from walking and public transport.","https://www.radlhauptstadt.muenchen.de/"]
["Bike sharing discounts for students","CAMPUSbike","Promotion of bike sharing","Urban, suburban","This program includes bike sharing discounts in many cities in Germany. The offers depend on the city, but often they include a free rental for the first 30min.","No impacts documented yet","https://www.nextbike.de/de/campusbike/"]
["Bike sharing discounts for train customers","ÖBB & Nextbike","Promotion of bike sharing\nPromotion of sustainability in first and last mile","Urban, suburban, rural","At many train stations in Austria, bike sharing offers including discounts for persons with a ÖBB Vorteilscard (customer card) are available, which is also relevant for promoting sustainable mobility solutions in the first and last mile.","No impacts documented yet","https://www.oebb.at/de/reiseplanung-services/am-bahnhof/nextbike"]
["Car sharing discounts","Car sharing discounts for students","Promotion of car sharing","Urban, suburban","The car sharing provider SHARE NOW offers discounts for students in several cities worldwide. This includes free registration, free parking and 5€ starting credit.","No impacts documented yet","https://www.studententarife.org/carsharing-fuer-studenten.html"]
["Programs for pupils","STARS, Rewards in the MUV app","Increasing the modal split of cycling\nIncreasing the modal split of walking","Urban, suburban, rural","The aim of STARS was to promote active mobility for journeys to and from school. It was carried out by partners from London, Edinburgh, Krakow, Budapest, Madrid, Milan, Brussels, Bielefeld and the Province of Noord Brabant. A website was set up where pupils could track their trips and compete with classmates and other schools across Europe. Furthermore, programs for primary and secondary schools were implemented. The first focuses on empowering primary schools to engage in active mobility. Schools could work their way up a scale from bronze to gold based on how strongly they promote active mobility. For secondary schools, a peer-to-peer engagement program was created. It empowered groups of pupils and gave them tools and ownership to develop, implement and monitor behavioral projects in their school.\nIn Piedmont, Italy, a project on the development of sustainable mobility for home/school trips is implemented. The main objective is to reduce the use of cars through the experimentation of single user/community rewards managed by the mobile application MUV.","The STARS project resulted in a 5.7% modal shift from motorized to active modes in primary schools and a 8.8% modal shift in secondary schools. 894 tons CO2 could be saved in 2 years.\nThe project from Piedmont also causes a modal shift and leads to a higher quality of life in a less polluted city.","http://starseurope.org/index.php","https://istitutovittone.it/it/index.php/19-la-scuola/793-progetto-samba"]
["Charges for vehicles","London, Stockholm, Milan, Gothenburg, Singapore","Increasing the modal split of public transport for leisure activities\nIncreasing the modal split of public transport for commuting","Urban","Charges are collected for driving a vehicle within a charged (inner city) zone. In London, Stockholm, Milan and Gothenburg, the charge is collected only on weekdays. In most cases, exceptions or discounts for residents or vehicles like taxis or buses are possible. In Singapore, every vehicle needs to be equipped with a device (In-vehicle Unit) for payment in order to be allowed to use priced roads.","In London, the charge led to a 20% reduction of vehicles subject to full charge and an increased share of public transport from 29% to 37%. MIV decreased from 46% to 36%. Additionally, positive effects on cycling could be detected. Also in the other cities, the traffic volume significantly dropped.","https://tfl.gov.uk/modes/driving/congestion-charge","https://www.roadtraffic-technology.com/projects/stockholm-congestion/","https://www.comune.milano.it/aree-tematiche/mobilita/area-c#navpageinside","https://www.bloomberg.com/news/articles","https://development.asia/case-study/case-electronic-road-pricing"]
["Collecting points for sustainable mobility behavior","TrafficO2","Increasing the modal split of public transport for leisure activities\nIncreasing the modal split of public transport for commuting\nIncreasing the modal split of cycling","Urban, suburban, rural","A mobile application provides challenges and information to promote sustainable transport. It was tested in Palermo. Routes are described according to the distance travelled, cost in €, CO2, calories burned and O2 points (as credits). The app tracks personal sustainability goals based on the user's habits. The users can win prizes and discount coupons based on the O2 points.","In six months, 300 testers registered over 18.000km and saved 55kg CO2.","www.traffico2.com"]
{"$rows_left_out":33}
{"sheet":"Glossary","index":3,"n_rows":11,"n_cols":3,"rows_kept":11,"cut":false,"hidden":false,"merged":[[4,1,4,2],[4,5,4,6]]}
[]
[]
[]
[]
[null,"Definitions of important terms"]
[null,"Dimension","Superodinate objective for better clarity"]
[null,"Goal","Specific objective being pursued in the target area"]
[null,"Parameters","Regional characteristics of the target area with influence on mobility including e.g. infrastructure, demography, topography and settlement"]
[null,"Measure","Policies that include an incentive/reward that motivates citizens to change their mobility behavior in favor of sustainable modes of transportation"]
[null,"Best practice","Application of a measure"]
[null,"Impact","Demonstrates the effect of a measure with the help of an indicator"]

{"sheet":"Database Measures","index":4,"n_rows":62,"n_cols":10,"rows_kept":62,"cut":false,"hidden":true,"merged":[]}
[{"$f":"IF(AND(OR(Tool!D13=\"Increasing the modal split of public transport for leisure\", Tool!D13=\"All public transport solutions\"),Tool!C17=\"Urban\",OR(Tool!C21=\"High\",Tool!C21=\"Medium\")),\"yes\",\"no\")","v":"no"},"Charges for vehicles","London, Stockholm, Milan, Gothenburg, Singapore","Modal split, traffic volume","Description: Charges are collected for driving a vehicle within a charged (inner city) zone. In London, Stockholm, Milan and Gothenburg, the charge is collected only on weekdays. In most cases, exceptions or discounts for residents or vehicles like taxis or buses are possible. In Singapore, every vehicle needs to be equipped with a device (In-vehicle Unit) for payment to be allowed to use priced roads.\nImpacts: In London, the charge led to a 20% reduction of vehicles subject to full charge and an increased share of public transport from 29% to 37%. MIV decreased from 46% to 36%. Additionally, positive effects on cycling could be detected. Also in the other cities, the traffic volume significantly dropped.","https://tfl.gov.uk/modes/driving/congestion-charge","https://www.roadtraffic-technology.com/projects/stockholm-congestion/","https://www.comune.milano.it/aree-tematiche/mobilita/area-c#navpageinside","https://www.bloomberg.com/news/articles/2015-04-20/gothenburg-sweden-s-congestion-pricing-program-is-a-big-success","https://development.asia/case-study/case-electronic-road-pricing"]
[{"$f":"IF(AND(OR(Tool!D13=\"Increasing the modal split of public transport for leisure\", Tool!D13=\"All public transport solutions\"), OR(Tool!C17=\"Urban\", Tool!C17=\"Suburban\"),OR(Tool!C21=\"High\",Tool!C21=\"Medium\")),\"yes\",\"no\")","v":"no"},"Incentives for residents to use less MIV","In motion program","Modal split","Description: This program was implemented in King County, Washington and provided residents with incentives to drive less and raised individual awareness on alternative travel options. Participants committed to change two trips per week from MIV to another mode for 12 weeks and every successful week they received a voucher to purchase public transport tickets, biking and walking gear or gasoline for carpooling.\nImpacts: Participants reduced MIV trips by 24%. Most trips were converted from MIV to public transport (40%), but the program had also high positive effects on walking.","https://www.nctr.usf.edu/wp-content/uploads/2013/12/77947.pdf"]
[{"$f":"IF(AND(OR(Tool!D13=\"Increasing the modal split of public transport for leisure\",Tool!D13=\"All public transport solutions\"), OR(Tool!C21=\"High\",Tool!C21=\"Medium\",Tool!C21=\"Low\"), OR(Tool!C17=\"Urban\",Tool!C17=\"Suburban\",Tool!C17=\"Rural\")),\"yes\",\"no\")","v":"no"},"Promoting public transport for events","Mit dem Zug zum Match","Modal split","Description: This program promotes journeys to sports competitions by train and has been initiated by the Salzburg Tennis Association. After the match, a communal meal with organic food is provided as a reward.\nImpacts: No impacts documented yes","https://mobilitaetsprojekte.vcoe.at/mit-dem-zug-zum-match?suchstr=belohnung"]
[{"$f":"IF(AND(OR(Tool!D13=\"Increasing the modal split of public transport for leisure\", Tool!D13=\"All public transport solutions\"), OR(Tool!C17=\"Urban\", Tool!C17=\"Suburban\", Tool!C17=\"Rural\"), OR(Tool!C21=\"High\", Tool!C21=\"Medium\") ),\"yes\",\"no\")","v":"no"},"Offers for new residents","Gscheid mobil","Modal split, CO2 emissions","Description: The city of Munich provides information for new residents about existing public transport offers to encourage them to try and eventually completely switch. Incentives are trial public transport tickets and trial public transport subscriptions.\nImpacts: The results of the pilot project from 2005/2006 showed that the share of public transport among the experiment group was almost 8% higher than the control group, while the share of MIV share among the experiment group was 3.3% lower than the control group. Furthermore, 700 tons of CO2 could be saved.","https://www.mvg.de/ueber/mvg-projekte/gscheid-mobil.html"]
[{"$f":"IF(AND(OR(Tool!D13=\"Increasing the modal split of public transport for leisure\", Tool!D13=\"All public transport solutions\"), OR(Tool!C17=\"Urban\", Tool!C17=\"Suburban\", Tool!C17=\"Rural\"), OR(Tool!C21=\"High\", Tool!C21=\"Medium\") ),\"yes\",\"no\")","v":"no"},"Collecting points for sustainable mobility behavior","TrafficO2","CO2 emissions","Description: A mobile application provides challenges and information to promote sustainable transport. Routes are described according to the distance travelled, cost in €, CO2, calories expended and O2 points (as credits). The app tracks personal sustainability goals based on the user's habits. The users can win prizes and discount coupons based on the O2 points.\nImpacts: In six months, 300 testers from Palermo registered over 18.000km and saved 55kg CO2.","www.traffico2.com"]
[{"$f":"IF(AND(OR(Tool!D13=\"Increasing the modal split of public transport for leisure\", Tool!D13=\"All public transport solutions\"), OR(Tool!C17=\"Urban\", Tool!C17=\"Suburban\", Tool!C17=\"Rural\"), OR(Tool!C21=\"High\", Tool!C21=\"Medium\") ),\"yes\",\"no\")","v":"no"},"Rewards for using fewer cars per household","One less car program","Modal split","Description: The goal of this program was for households to park one of their cars and use other modes instead. Participants received 85$ per week as a compensation for recording their data and as an economic incentive. This program was implemented in Seattle with 86 households over a period of 6-9 weeks.\nImpacts: It helped to reduce drive-alone car miles of participants by 27%. Public transport mileage increased by 25% and the project additionally also had great positive effects on cycling, walking and carpooling.","https://www.nctr.usf.edu/wp-content/uploads/2014/11/77947_508.pdf"]
[{"$f":"IF(AND(OR(Tool!D13=\"Increasing the modal split of public transport for leisure\",Tool!D13=\"All public transport solutions\"),OR(Tool!C17=\"Urban\", Tool!C17=\"Suburban\"), OR(Tool!C21=\"High\", Tool!C21=\"Medium\") ),\"yes\",\"no\")","v":"no"},"Voucher programs","Transit voucher program","Modal split","Description: Third-party benefit administrators and/or transit agencies issue vouchers that riders give to participating transportation providers to acquire fare media. Employers may subsidized the costs of the vouchers to create an incentive to use public transport. Transit voucher programs are implemented in many US cities, e.g. San Francisco, Philadelphia and New York.\nImpacts: An analysis shows that commuter trips shifted by 20% from MIV to public transport.","https://www.nctr.usf.edu/wp-content/uploads/2013/12/77947.pdf"]
[{"$f":"IF(AND(OR(Tool!D13=\"Increasing the modal split of public transport for commuting\",Tool!D13=\"All public transport solutions\"),Tool!C23=\"Yes\",OR(Tool!C17=\"Urban\",Tool!C17=\"Suburban\"),OR(Tool!C21=\"High\",Tool!C21=\"Medium\")),\"yes\",\"no\")","v":"no"},"Rewards for not using a parking space","Parking cash out program","Modal split","Description: Employees are given the choice between a free parking space and cash.\nImpacts: An analysis of eight Californian companies shows that with the help of this program the modal split among participants decreased from 76% to 63%, while the modal split of public transport increased from 6% to 9%. The project had also positive effects on the shares of carpooling, cycling and walking.","https://www.nctr.usf.edu/wp-content/uploads/2013/12/77947.pdf"]
[{"$f":"IF(AND(Tool!D13=\"Increasing the modal split of public transport for commuting\", Tool!C23=\"Yes\", OR(Tool!C17=\"Urban\", Tool!C17=\"Suburban\"),OR(Tool!C21=\"High\",Tool!C21=\"Medium\")),\"yes\",\"no\")","v":"no"},"Incentives for residents to use less MIV","In motion program","Modal split","Description: This program was implemented in King County, Washington and provided residents with incentives to drive less and raised individual awareness on alternative travel options. Participants committed to change two trips per week from MIV to another mode for 12 weeks and for every successful week they received a voucher to purchase public transport tickets, biking and walking gear or gasoline for carpooling.\nImpacts: Participants reduced MIV trips by 24%. Most trips were converted from MIV to public transport (40%), but the program had also high positive effects on walking.","https://www.nctr.usf.edu/wp-content/uploads/2013/12/77947.pdf"]
[{"$f":"IF(AND(Tool!D13=\"Increasing the modal split of public transport for commuting\",Tool!C23=\"Yes\", OR(Tool!C17=\"Urban\", Tool!C17=\"Suburban\", Tool!C17=\"Rural\"), OR(Tool!C21=\"High\", Tool!C21=\"Medium\") ),\"yes\",\"no\")","v":"no"},"Collecting points for sustainable mobility behavior","TrafficO2","CO2 emissions","Description: A mobile application provides challenges and information to promote sustainable transport. Routes are described according to the distance travelled, cost in €, CO2, calories expended and O2 points (as credits). The app tracks personal sustainability goals based on the user's habits. The users can win prizes and discount coupons based on the O2 points.\nImpacts: In six months, 300 testers from Palermo registered over 18.000km and saved 55kg CO2.","www.traffico2.com"]
[{"$f":"IF(AND(OR(Tool!D13=\"Increasing the modal split of public transport for commuting\",Tool!D13=\"All public transport solutions\"),Tool!C23=\"Yes\", Tool!C17=\"Urban\", OR(Tool!C21=\"High\", Tool!C21=\"Medium\") ),\"yes\",\"no\")","v":"no"},"Rewards for avoiding peaks","MIMOSA, Spitsmijden","Modal split, traffic volume","In the MIMOSA project, participants receive 4€ when they avoid main traffic axes roads during 6 and 10 AM. The project helped to reduce the traffic volume between 500 and 700 cars during the morning rush hour in Utrecht.\nIn the Spitsmijden program, commuters get rewards for avoiding car travel during peaks. They receive 7€ for avoiding the entire morning peak and 3€ for avoiding 7:30 to 8 and 9 to 9:30. The program was tested on the Dutch A12 motorway corridor from Zoetermeer towards The Hague and led to a decline of total car-use from 70% to 65% mainly due to an increased use of public transport. ","https://civitas.eu/content/mimosa","https://www.vtpi.org/spitsmijden.pdf"]
[{"$f":"IF(AND(Tool!D13=\"Increasing the modal split of public transport for commuting\", Tool!C23=\"Yes\", Tool!C17=\"Urban\",OR(Tool!C21=\"High\",Tool!C21=\"Medium\")),\"yes\",\"no\")","v":"no"},"Charges for vehicles","London, Stockholm, Milan, Gothenburg, Singapore","Modal split, traffic volume","Description: Charges are collected for driving a vehicle within a charged (inner city) zone. In London, Stockholm, Milan and Gothenburg, the charge is collected only on weekdays. In most cases, exceptions or discounts for residents or vehicles like taxis or buses are possible. In Singapore, every vehicle needs to be equipped with a device (In-vehicle Unit) for payment in order to be allowed to use priced roads.\nImpacts: In London, the charge led to a 20% reduction of vehicles subject to full charge and an increased share of public transport from 29% to 37%. MIV decreased from 46% to 36%. Additionally, positive effects on cycling could be detected. Also in the other cities, the traffic volume significantly dropped.","https://tfl.gov.uk/modes/driving/congestion-charge","https://www.roadtraffic-technology.com/projects/stockholm-congestion/","https://www.comune.milano.it/aree-tematiche/mobilita/area-c#navpageinside","https://www.bloomberg.com/news/articles/2015-04-20/gothenburg-sweden-s-congestion-pricing-program-is-a-big-success","https://development.asia/case-study/case-electronic-road-pricing"]
[{"$f":"IF(AND(OR(Tool!D13=\"Increasing the modal split of public transport for commuting\", Tool!D13=\"All public transport solutions\"), Tool!C23=\"Yes\", OR(Tool!C17=\"Urban\", Tool!C17=\"Suburban\", Tool!C17=\"Rural\"), OR(Tool!C21=\"High\", Tool!C21=\"Medium\") ),\"yes\",\"no\")","v":"no"},"Commuter challenges for reducing traffic during peaks","MOBI","Modal split","Description: MOBI was implemented by partners from the Netherlands, Belgium, UK, Bulgaria, Romania and Portugal. It encourages a travel behavior change in order to reduce traffic during peak hours. The users get feedback and information on saved energy and play as a team competing against other teams to see how many sustainable trips are made each week.\nImpacts: The project resulted in an increased share of sustainable modes from 58% to 80% among participants and a reduced share of MIV from 65% to 42%. Public transport increased from 19% to 28%, but MOBI had also positive effects on cycling and carpooling.","http://www.mobi-project.eu/"]
[{"$f":"IF(AND(Tool!D13=\"Increasing the modal split of public transport for commuting\", Tool!C23=\"Yes\", OR(Tool!C17=\"Urban\", Tool!C17=\"Suburban\"),OR(Tool!C21=\"High\",Tool!C21=\"Medium\")),\"yes\",\"no\")","v":"no"},"Voucher programs","Transit voucher program","Modal split","Description: Third-party benefit administrators and/or transit agencies issue vouchers that riders give to participating transportation providers to acquire fare media. Employers may subsidized the costs of the vouchers to create an incentive to use public transport.\nImpacts: Transit voucher programs are implemented in many US cities, e.g. San Francisco, Philadelphia and New York. An analysis shows that commuter trips shifted by 20% from MIV to public transport.","https://www.nctr.usf.edu/wp-content/uploads/2013/12/77947.pdf"]
[{"$f":"IF(AND(OR(Tool!D13=\"Increasing the modal split of public transport for commuting\", Tool!D13=\"All public transport solutions\"),Tool!C25=\"Yes\", OR(Tool!C17=\"Urban\", Tool!C17=\"Suburban\", Tool!C17=\"Rural\"),OR(Tool!C21=\"High\",Tool!C21=\"Medium\")),\"yes\",\"no\")","v":"no"},"Rewards for children using sustainable modes on the way to school","Traffic Snake Game","Modal split, CO2 emissions","Description: This project was implemented in a great number of European countries. Children received a sticker for every day they walked, cycled, used public transport or shared a car journey to school. The goal was to collect as many stickers on a banner as possible. The children got rewards for reaching key points on the banner (e.g. no homework) and completing it (e.g. cycling tour). \nImpacts: It led to a reduction of CO2 emissions. The total increase in the modal split of public transit among participants across all countries is 1%, but the project had even larger effects on walking and carpooling.","https://www.trafficsnakegame.eu/"]
{"$rows_left_out":48}
{"sheet":"Dropdowns","index":5,"n_rows":31,"n_cols":7,"rows_kept":31,"cut":false,"hidden":true,"merged":[]}
["Dropdown1","Startpos","Elements",null,"Pos","Dropdown2","Dropdown Overview"]
["Promotion of public transport",1,3,null,1,"Increasing the modal split of public transport for leisure","Increasing the modal split of public transport for leisure"]
["Promotion of active modes",4,3,null,2,"Increasing the modal split of public transport for commuting","Increasing the modal split of public transport for commuting"]
["Promotion of mulitmodality and access",7,3,null,3,"All public transport solutions","Increasing the modal split of cycling"]
["Promotion of sharing systems",10,4,null,4,"Increasing the modal split of cycling","Increasing the modal split of walking"]
[null,null,null,null,5,"Increasing the modal split of walking","Promotion of park & ride"]
[null,null,null,null,6,"All active mode solutions","Promotion of sustainability in first and last mile"]
[null,null,null,null,7,"Promotion of park & ride","Promotion of ride sharing"]
[null,null,null,null,8,"Promotion of sustainability in first and last mile","Promotion of car sharing"]
[null,null,null,null,9,"All multimodality and access solutions","Promotion of bike sharing"]
[null,null,null,null,10,"Promotion of ride sharing"]
[null,null,null,null,11,"Promotion of car sharing"]
[null,null,null,null,12,"Promotion of bike sharing"]
[null,null,null,null,13,"All sharing solutions"]
["Yes"]
{"$rows_left_out":16}